修改后输出:后处理失败:820:39:参数列表缺少逗号
哈喽!大家好,很高兴又见面了,我是golang学习网的一名作者,今天由我给大家带来一篇《修改后输出:后处理失败:820:39:参数列表缺少逗号》,本文主要会讲到等等知识点,希望大家一起学习进步,也欢迎大家关注、点赞、收藏、转发! 下面就一起来看看吧!
protoc-gen-validate
是一个协议插件,用于生成多语言消息验证器。
该项目使用 bazel 进行构建,并有一个开放的拉取请求来添加对验证错误消息自定义的支持。
原始代码是2020年制作的。最近更新了最新代码,修复了所有合并冲突后,现在无法构建,但我找不到问题:
~/github/protoc-gen-validate (i18n) $ make bazel-tests bazel test //tests/... --test_output=errors info: analyzed 68 targets (0 packages loaded, 0 targets configured). info: found 62 targets and 6 test targets... error: /users/mparnisari/github/protoc-gen-validate/tests/harness/cases/build:46:21: generating into bazel-out/darwin-fastbuild/bin/tests/harness/cases/go_/github.com/envoyproxy/protoc-gen-validate/tests/harness/cases/go failed: (exit 1): go-protoc-bin failed: error executing command bazel-out/darwin-opt-exec-2b5cbbc6/bin/external/io_bazel_rules_go/go/tools/builders/go-protoc-bin_/go-protoc-bin -protoc bazel-out/darwin-opt-exec-2b5cbbc6/bin/external/com_google_protobuf/protoc ... (remaining 117 argument(s) skipped) use --sandbox_debug to see verbose messages from the sandbox [error] failed post-processing: 820:39: missing ',' in argument list (and 10 more errors) --validate_out: protoc-gen-validate: plugin failed with status code 1. 2021/12/14 23:46:43 error running protoc: exit status 1 error: /users/mparnisari/github/protoc-gen-validate/tests/harness/cases/build:46:21 gocompilepkg tests/harness/cases/go.a failed: (exit 1): go-protoc-bin failed: error executing command bazel-out/darwin-opt-exec-2b5cbbc6/bin/external/io_bazel_rules_go/go/tools/builders/go-protoc-bin_/go-protoc-bin -protoc bazel-out/darwin-opt-exec-2b5cbbc6/bin/external/com_google_protobuf/protoc ... (remaining 117 argument(s) skipped) use --sandbox_debug to see verbose messages from the sandbox info: elapsed time: 0.962s, critical path: 0.48s info: 8 processes: 8 internal. failed: build did not complete successfully
根据以下事实判断,在我触发测试命令后立即出现错误 ([error] failed post-processing: 820:39: missing ',' in argument list (and 10 more error)
),我想这是 bazel 的问题,但我不确定。
更新 1:我将范围缩小到:
~/GitHub/fork/protoc-gen-validate (i18n) $ make testcases cd tests/harness/cases && \ protoc \ -I . \ -I ../../.. \ --go_out="module=github.com/envoyproxy/protoc-gen-validate/tests/harness/cases/go,Mtests/harness/cases/other_package/embed.proto=github.com/envoyproxy/protoc-gen-validate/tests/harness/cases/other_package/go;other_package,Mtests/harness/cases/yet_another_package/embed.proto=github.com/envoyproxy/protoc-gen-validate/tests/harness/cases/yet_another_package/go,Mvalidate/validate.proto=github.com/envoyproxy/protoc-gen-validate/validate,Mgoogle/protobuf/any.proto=google.golang.org/protobuf/types/known/anypb,Mgoogle/protobuf/duration.proto=google.golang.org/protobuf/types/known/durationpb,Mgoogle/protobuf/struct.proto=google.golang.org/protobuf/types/known/structpb,Mgoogle/protobuf/timestamp.proto=google.golang.org/protobuf/types/known/timestamppb,Mgoogle/protobuf/wrappers.proto=google.golang.org/protobuf/types/known/wrapperspb,Mgoogle/protobuf/descriptor.proto=google.golang.org/protobuf/types/descriptorpb:./go" \ --plugin=protoc-gen-go=/Users/mparnisari/go/bin/protoc-gen-go \ --validate_out="module=github.com/envoyproxy/protoc-gen-validate/tests/harness/cases/go,lang=go,Mtests/harness/cases/other_package/embed.proto=github.com/envoyproxy/protoc-gen-validate/tests/harness/cases/other_package/go,Mtests/harness/cases/yet_another_package/embed.proto=github.com/envoyproxy/protoc-gen-validate/tests/harness/cases/yet_another_package/go:./go" \ ./*.proto filename-with-dash.proto:5:1: warning: Import validate/validate.proto is unused. [error] failed post-processing: 820:39: missing ',' in argument list (and 10 more errors) --validate_out: protoc-gen-validate: Plugin failed with status code 1. make: *** [testcases] Error 1
更新2:缩小范围。如果我删除这个文件:tests/harness/cases/maps.proto
make 测试用例
有效
更新3:缩小范围。如果我删除这些行:https://github.com/envoyproxy/protoc-gen-validate/blob/main/tests/harness/cases/maps.proto#l14-l17
make testcase
有效
正确答案
使用开关 --sandbox_debug
进行构建将提供未截断的堆栈跟踪。
这都是因为缺少一个逗号……唯一的问题是在哪个文件和行中。
它抱怨 harness_py_proto
测试 @ 46:21
。建议对文件 tests/harness/executor/cases.go
运行语法检查,因为如果 820:39
不在某些生成的文件中,则这可能是最适合的文件(按行号和错误消息)。我对 go 语法不太熟悉,这就是为什么我无法一眼发现它 - 但语法检查器或 linter 可以:
lint bazel testcases bazel-tests
makefile
也可能是一个可能的候选者,但没有太多进展:
.phony: harness harness: testcases tests/harness/go/harness.pb.go tests/harness/go/main/go-harness tests/harness/cc/cc-harness bin/harness ## runs the test harness, validating a series of test cases in all supported languages ./bin/harness -go -cc .phony: bazel-tests bazel-tests: ## runs all tests with bazel bazel test //tests/... --test_output=errors
以前是否尝试过运行 makeharness
?当它按照评论所说的那样时......
## runs the test harness, validating a series of test cases in all supported languages
今天关于《修改后输出:后处理失败:820:39:参数列表缺少逗号》的内容介绍就到此结束,如果有什么疑问或者建议,可以在golang学习网公众号下多多回复交流;文中若有不正之处,也希望回复留言以告知!

- 上一篇
- Flask框架安装教程:快速掌握Flask框架的安装步骤

- 下一篇
- 使用jQuery删除元素的层叠顺序属性
-
- Golang · Go问答 | 1年前 |
- 在读取缓冲通道中的内容之前退出
- 139浏览 收藏
-
- Golang · Go问答 | 1年前 |
- 戈兰岛的全球 GOPRIVATE 设置
- 204浏览 收藏
-
- Golang · Go问答 | 1年前 |
- 如何将结构作为参数传递给 xml-rpc
- 325浏览 收藏
-
- Golang · Go问答 | 1年前 |
- 如何用golang获得小数点以下两位长度?
- 477浏览 收藏
-
- Golang · Go问答 | 1年前 |
- 如何通过 client-go 和 golang 检索 Kubernetes 指标
- 486浏览 收藏
-
- Golang · Go问答 | 1年前 |
- 将多个“参数”映射到单个可变参数的习惯用法
- 439浏览 收藏
-
- Golang · Go问答 | 1年前 |
- 将 HTTP 响应正文写入文件后出现 EOF 错误
- 357浏览 收藏
-
- Golang · Go问答 | 1年前 |
- 结构中映射的匿名列表的“复合文字中缺少类型”
- 352浏览 收藏
-
- Golang · Go问答 | 1年前 |
- NATS Jetstream 的性能
- 101浏览 收藏
-
- Golang · Go问答 | 1年前 |
- 如何将复杂的字符串输入转换为mapstring?
- 440浏览 收藏
-
- Golang · Go问答 | 1年前 |
- 相当于GoLang中Java将Object作为方法参数传递
- 212浏览 收藏
-
- Golang · Go问答 | 1年前 |
- 如何确保所有 goroutine 在没有 time.Sleep 的情况下终止?
- 143浏览 收藏
-
- 前端进阶之JavaScript设计模式
- 设计模式是开发人员在软件开发过程中面临一般问题时的解决方案,代表了最佳的实践。本课程的主打内容包括JS常见设计模式以及具体应用场景,打造一站式知识长龙服务,适合有JS基础的同学学习。
- 542次学习
-
- GO语言核心编程课程
- 本课程采用真实案例,全面具体可落地,从理论到实践,一步一步将GO核心编程技术、编程思想、底层实现融会贯通,使学习者贴近时代脉搏,做IT互联网时代的弄潮儿。
- 508次学习
-
- 简单聊聊mysql8与网络通信
- 如有问题加微信:Le-studyg;在课程中,我们将首先介绍MySQL8的新特性,包括性能优化、安全增强、新数据类型等,帮助学生快速熟悉MySQL8的最新功能。接着,我们将深入解析MySQL的网络通信机制,包括协议、连接管理、数据传输等,让
- 497次学习
-
- JavaScript正则表达式基础与实战
- 在任何一门编程语言中,正则表达式,都是一项重要的知识,它提供了高效的字符串匹配与捕获机制,可以极大的简化程序设计。
- 487次学习
-
- 从零制作响应式网站—Grid布局
- 本系列教程将展示从零制作一个假想的网络科技公司官网,分为导航,轮播,关于我们,成功案例,服务流程,团队介绍,数据部分,公司动态,底部信息等内容区块。网站整体采用CSSGrid布局,支持响应式,有流畅过渡和展现动画。
- 484次学习
-
- 笔灵AI生成答辩PPT
- 探索笔灵AI生成答辩PPT的强大功能,快速制作高质量答辩PPT。精准内容提取、多样模板匹配、数据可视化、配套自述稿生成,让您的学术和职场展示更加专业与高效。
- 24次使用
-
- 知网AIGC检测服务系统
- 知网AIGC检测服务系统,专注于检测学术文本中的疑似AI生成内容。依托知网海量高质量文献资源,结合先进的“知识增强AIGC检测技术”,系统能够从语言模式和语义逻辑两方面精准识别AI生成内容,适用于学术研究、教育和企业领域,确保文本的真实性和原创性。
- 38次使用
-
- AIGC检测-Aibiye
- AIbiye官网推出的AIGC检测服务,专注于检测ChatGPT、Gemini、Claude等AIGC工具生成的文本,帮助用户确保论文的原创性和学术规范。支持txt和doc(x)格式,检测范围为论文正文,提供高准确性和便捷的用户体验。
- 38次使用
-
- 易笔AI论文
- 易笔AI论文平台提供自动写作、格式校对、查重检测等功能,支持多种学术领域的论文生成。价格优惠,界面友好,操作简便,适用于学术研究者、学生及论文辅导机构。
- 50次使用
-
- 笔启AI论文写作平台
- 笔启AI论文写作平台提供多类型论文生成服务,支持多语言写作,满足学术研究者、学生和职场人士的需求。平台采用AI 4.0版本,确保论文质量和原创性,并提供查重保障和隐私保护。
- 41次使用
-
- GoLand调式动态执行代码
- 2023-01-13 502浏览
-
- 用Nginx反向代理部署go写的网站。
- 2023-01-17 502浏览
-
- Golang取得代码运行时间的问题
- 2023-02-24 501浏览
-
- 请问 go 代码如何实现在代码改动后不需要Ctrl+c,然后重新 go run *.go 文件?
- 2023-01-08 501浏览
-
- 如何从同一个 io.Reader 读取多次
- 2023-04-11 501浏览